{"text_format":"1","workbook":"xlsx","n_sheets":6,"sheets":["Deficiencies","Instructions","Grade Checks","Vertical Curve Checks","Horizontal Curve","Bridge Considerations"],"not_rendered":{"charts":0,"images":0,"macros":1,"external_links":0,"defined_names":45,"comments":0,"pivot_tables":0},"unopened":[],"bounds":{"document_bytes":16777216,"sheet_cells":100000,"rows_first":2000,"rows_last":500,"rows_between":2000,"halvings":0,"cell_chars":16384,"cell_head_chars":4096},"cells_cut":0,"cells_raw":0,"read":"whole","date_system":"1900"}

{"sheet":"Deficiencies","index":0,"n_rows":58,"n_cols":15,"rows_kept":58,"cut":false,"hidden":false,"merged":[[50,5,51,5],[50,6,50,7],[50,10,51,10],[1,1,1,7],[40,1,40,6],[35,1,37,1],[33,0,33,1],[50,0,51,0],[50,1,51,1],[50,2,51,2],[50,3,51,3],[50,4,51,4],[40,7,40,11],[39,0,39,8],[49,0,49,8],[19,14,21,14],[0,1,0,7],[2,1,2,7],[20,10,20,13],[5,0,5,8],[20,6,20,9],[20,1,20,5],[5,9,6,9],[19,0,19,8]]}
["Project ID:","1440-39-30"]
["Description:","FDL - Plymouth, USH 151 - CTH UU"]
["Highway:","STH 23",null,null,null,null,null,null,null,"55 MPH zone starts about 3600' east of CTH K"]
[]
[]
["Vertical Curve",null,null,null,null,null,null,null,null,"Key"]
["Asbuilt Plan","Location","PI","Type","Length","Design Speed","K & SSD Pass/Fail","Design Speed Testing","Length Extension Testing"]
[{"$f":"IF('Vertical Curve Checks'!A7=\"\",\"\",'Vertical Curve Checks'!A7)","v":"1442-01-73"},{"$f":"IF('Vertical Curve Checks'!B7=\"\",\"\",'Vertical Curve Checks'!B7)","v":"STH 23 WB, 2040' East of CTH K"},{"$f":"IF('Vertical Curve Checks'!C7=\"\",\"\",'Vertical Curve Checks'!C7)","v":"157+00"},{"$f":"IF('Vertical Curve Checks'!E7=\"\",\"\",'Vertical Curve Checks'!E7)","v":"crest"},{"$f":"IF('Vertical Curve Checks'!F7=\"\",\"\",'Vertical Curve Checks'!F7)","v":1450},{"$f":"IF('Vertical Curve Checks'!G7=\"\",\"\",'Vertical Curve Checks'!G7)","v":7},{"$f":"'Vertical Curve Checks'!U7","v":"Both Pass"},{"$f":"'Vertical Curve Checks'!U22","v":"Pass"},{"$f":"'Vertical Curve Checks'!U37","v":"K Pass/ SSD Fail"},{"$f":"'Vertical Curve Checks'!W7","v":1}]
[{"$f":"IF('Vertical Curve Checks'!A8=\"\",\"\",'Vertical Curve Checks'!A8)","v":"1442-01-73"},{"$f":"IF('Vertical Curve Checks'!B8=\"\",\"\",'Vertical Curve Checks'!B8)","v":"STH 23 EB, 2040' East of CTH K"},{"$f":"IF('Vertical Curve Checks'!C8=\"\",\"\",'Vertical Curve Checks'!C8)","v":"157+00"},{"$f":"IF('Vertical Curve Checks'!E8=\"\",\"\",'Vertical Curve Checks'!E8)","v":"crest"},{"$f":"IF('Vertical Curve Checks'!F8=\"\",\"\",'Vertical Curve Checks'!F8)","v":1450},{"$f":"IF('Vertical Curve Checks'!G8=\"\",\"\",'Vertical Curve Checks'!G8)","v":7},{"$f":"'Vertical Curve Checks'!U8","v":"Both Pass"},{"$f":"'Vertical Curve Checks'!U23","v":"Pass"},{"$f":"'Vertical Curve Checks'!U38","v":"K Pass/ SSD Fail"},{"$f":"'Vertical Curve Checks'!W8","v":2}]
[{"$f":"IF('Vertical Curve Checks'!A9=\"\",\"\",'Vertical Curve Checks'!A9)","v":"1442-01-73"},{"$f":"IF('Vertical Curve Checks'!B9=\"\",\"\",'Vertical Curve Checks'!B9)","v":"STH 23, 3640' East of CTH K"},{"$f":"IF('Vertical Curve Checks'!C9=\"\",\"\",'Vertical Curve Checks'!C9)","v":"173+00"},{"$f":"IF('Vertical Curve Checks'!E9=\"\",\"\",'Vertical Curve Checks'!E9)","v":"sag"},{"$f":"IF('Vertical Curve Checks'!F9=\"\",\"\",'Vertical Curve Checks'!F9)","v":1100},{"$f":"IF('Vertical Curve Checks'!G9=\"\",\"\",'Vertical Curve Checks'!G9)","v":-0.41},{"$f":"'Vertical Curve Checks'!U9","v":"Both Pass"},{"$f":"'Vertical Curve Checks'!U24","v":"Pass"},{"$f":"'Vertical Curve Checks'!U39","v":"K Pass/ SSD Fail"},{"$f":"'Vertical Curve Checks'!W9","v":3}]
[{"$f":"IF('Vertical Curve Checks'!A10=\"\",\"\",'Vertical Curve Checks'!A10)","v":"1442-01-73"},{"$f":"IF('Vertical Curve Checks'!B10=\"\",\"\",'Vertical Curve Checks'!B10)","v":"STH 23, 1790' West of CTH UU"},{"$f":"IF('Vertical Curve Checks'!C10=\"\",\"\",'Vertical Curve Checks'!C10)","v":"185+50"},{"$f":"IF('Vertical Curve Checks'!E10=\"\",\"\",'Vertical Curve Checks'!E10)","v":"crest"},{"$f":"IF('Vertical Curve Checks'!F10=\"\",\"\",'Vertical Curve Checks'!F10)","v":1200},{"$f":"IF('Vertical Curve Checks'!G10=\"\",\"\",'Vertical Curve Checks'!G10)","v":4.992},{"$f":"'Vertical Curve Checks'!U10","v":"Both Pass"},{"$f":"'Vertical Curve Checks'!U25","v":"Pass"},{"$f":"'Vertical Curve Checks'!U40","v":"K Pass/ SSD Fail"},{"$f":"'Vertical Curve Checks'!W10","v":4}]
[{"$f":"IF('Vertical Curve Checks'!A11=\"\",\"\",'Vertical Curve Checks'!A11)","v":"1442-01-73"},{"$f":"IF('Vertical Curve Checks'!B11=\"\",\"\",'Vertical Curve Checks'!B11)","v":"STH 23, 840' West of CTH UU"},{"$f":"IF('Vertical Curve Checks'!C11=\"\",\"\",'Vertical Curve Checks'!C11)","v":"195+00"},{"$f":"IF('Vertical Curve Checks'!E11=\"\",\"\",'Vertical Curve Checks'!E11)","v":"sag"},{"$f":"IF('Vertical Curve Checks'!F11=\"\",\"\",'Vertical Curve Checks'!F11)","v":300},{"$f":"IF('Vertical Curve Checks'!G11=\"\",\"\",'Vertical Curve Checks'!G11)","v":-0.78500000000000003},{"$f":"'Vertical Curve Checks'!U11","v":"Both Pass"},{"$f":"'Vertical Curve Checks'!U26","v":"Pass"},{"$f":"'Vertical Curve Checks'!U41","v":"K Pass/ SSD Fail"},{"$f":"'Vertical Curve Checks'!W11","v":5}]
[{"$f":"IF('Vertical Curve Checks'!A12=\"\",\"\",'Vertical Curve Checks'!A12)","v":""},{"$f":"IF('Vertical Curve Checks'!B12=\"\",\"\",'Vertical Curve Checks'!B12)","v":""},{"$f":"IF('Vertical Curve Checks'!C12=\"\",\"\",'Vertical Curve Checks'!C12)","v":""},{"$f":"IF('Vertical Curve Checks'!E12=\"\",\"\",'Vertical Curve Checks'!E12)","v":""},{"$f":"IF('Vertical Curve Checks'!F12=\"\",\"\",'Vertical Curve Checks'!F12)","v":""},{"$f":"IF('Vertical Curve Checks'!G12=\"\",\"\",'Vertical Curve Checks'!G12)","v":""},{"$f":"'Vertical Curve Checks'!U12","v":""},{"$f":"'Vertical Curve Checks'!U27","v":""},{"$f":"'Vertical Curve Checks'!U42","v":""},{"$f":"'Vertical Curve Checks'!W12","v":6}]
[{"$f":"IF('Vertical Curve Checks'!A13=\"\",\"\",'Vertical Curve Checks'!A13)","v":""},{"$f":"IF('Vertical Curve Checks'!B13=\"\",\"\",'Vertical Curve Checks'!B13)","v":""},{"$f":"IF('Vertical Curve Checks'!C13=\"\",\"\",'Vertical Curve Checks'!C13)","v":""},{"$f":"IF('Vertical Curve Checks'!E13=\"\",\"\",'Vertical Curve Checks'!E13)","v":""},{"$f":"IF('Vertical Curve Checks'!F13=\"\",\"\",'Vertical Curve Checks'!F13)","v":""},{"$f":"IF('Vertical Curve Checks'!G13=\"\",\"\",'Vertical Curve Checks'!G13)","v":""},{"$f":"'Vertical Curve Checks'!U13","v":""},{"$f":"'Vertical Curve Checks'!U28","v":""},{"$f":"'Vertical Curve Checks'!U43","v":""},{"$f":"'Vertical Curve Checks'!W13","v":7}]
[{"$f":"IF('Vertical Curve Checks'!A14=\"\",\"\",'Vertical Curve Checks'!A14)","v":""},{"$f":"IF('Vertical Curve Checks'!B14=\"\",\"\",'Vertical Curve Checks'!B14)","v":""},{"$f":"IF('Vertical Curve Checks'!C14=\"\",\"\",'Vertical Curve Checks'!C14)","v":""},{"$f":"IF('Vertical Curve Checks'!E14=\"\",\"\",'Vertical Curve Checks'!E14)","v":""},{"$f":"IF('Vertical Curve Checks'!F14=\"\",\"\",'Vertical Curve Checks'!F14)","v":""},{"$f":"IF('Vertical Curve Checks'!G14=\"\",\"\",'Vertical Curve Checks'!G14)","v":""},{"$f":"'Vertical Curve Checks'!U14","v":""},{"$f":"'Vertical Curve Checks'!U29","v":""},{"$f":"'Vertical Curve Checks'!U44","v":""},{"$f":"'Vertical Curve Checks'!W14","v":8}]
[{"$f":"IF('Vertical Curve Checks'!A15=\"\",\"\",'Vertical Curve Checks'!A15)","v":""},{"$f":"IF('Vertical Curve Checks'!B15=\"\",\"\",'Vertical Curve Checks'!B15)","v":""},{"$f":"IF('Vertical Curve Checks'!C15=\"\",\"\",'Vertical Curve Checks'!C15)","v":""},{"$f":"IF('Vertical Curve Checks'!E15=\"\",\"\",'Vertical Curve Checks'!E15)","v":""},{"$f":"IF('Vertical Curve Checks'!F15=\"\",\"\",'Vertical Curve Checks'!F15)","v":""},{"$f":"IF('Vertical Curve Checks'!G15=\"\",\"\",'Vertical Curve Checks'!G15)","v":""},{"$f":"'Vertical Curve Checks'!U15","v":""},{"$f":"'Vertical Curve Checks'!U30","v":""},{"$f":"'Vertical Curve Checks'!U45","v":""},{"$f":"'Vertical Curve Checks'!W15","v":9}]
[{"$f":"IF('Vertical Curve Checks'!A16=\"\",\"\",'Vertical Curve Checks'!A16)","v":""},{"$f":"IF('Vertical Curve Checks'!B16=\"\",\"\",'Vertical Curve Checks'!B16)","v":""},{"$f":"IF('Vertical Curve Checks'!C16=\"\",\"\",'Vertical Curve Checks'!C16)","v":""},{"$f":"IF('Vertical Curve Checks'!E16=\"\",\"\",'Vertical Curve Checks'!E16)","v":""},{"$f":"IF('Vertical Curve Checks'!F16=\"\",\"\",'Vertical Curve Checks'!F16)","v":""},{"$f":"IF('Vertical Curve Checks'!G16=\"\",\"\",'Vertical Curve Checks'!G16)","v":""},{"$f":"'Vertical Curve Checks'!U16","v":""},{"$f":"'Vertical Curve Checks'!U31","v":""},{"$f":"'Vertical Curve Checks'!U46","v":""},{"$f":"'Vertical Curve Checks'!W16","v":10}]
[{"$f":"IF('Vertical Curve Checks'!A17=\"\",\"\",'Vertical Curve Checks'!A17)","v":""},{"$f":"IF('Vertical Curve Checks'!B17=\"\",\"\",'Vertical Curve Checks'!B17)","v":""},{"$f":"IF('Vertical Curve Checks'!C17=\"\",\"\",'Vertical Curve Checks'!C17)","v":""},{"$f":"IF('Vertical Curve Checks'!E17=\"\",\"\",'Vertical Curve Checks'!E17)","v":""},{"$f":"IF('Vertical Curve Checks'!F17=\"\",\"\",'Vertical Curve Checks'!F17)","v":""},{"$f":"IF('Vertical Curve Checks'!G17=\"\",\"\",'Vertical Curve Checks'!G17)","v":""},{"$f":"'Vertical Curve Checks'!U17","v":""},{"$f":"'Vertical Curve Checks'!U32","v":""},{"$f":"'Vertical Curve Checks'!U47","v":""},{"$f":"'Vertical Curve Checks'!W17","v":11}]
[]
["Horizontal Curve",null,null,null,null,null,null,null,null,null,null,null,null,null,"Key"]
{"$rows_left_out":39}
{"sheet":"Instructions","index":1,"n_rows":45,"n_cols":10,"rows_kept":45,"cut":false,"hidden":false,"merged":[[0,0,2,12],[7,8,7,12],[6,8,6,12],[7,0,7,4],[32,1,32,4],[6,0,6,4],[22,0,23,4],[24,1,24,4],[25,1,25,4],[26,1,26,4],[27,1,27,4],[28,1,28,4],[29,1,29,4],[30,1,30,4],[31,1,31,4],[24,5,27,7],[36,0,37,4],[36,8,37,12],[39,1,39,4],[38,1,38,4],[33,1,33,4],[31,5,32,7],[32,8,32,12],[33,8,33,12],[22,8,23,12],[26,8,26,12],[24,8,24,12],[25,8,25,12],[27,8,27,12],[28,8,28,12],[29,8,29,12],[30,8,30,12],[31,8,31,12],[40,1,40,4],[41,1,41,4],[42,1,42,4],[43,1,43,4],[44,1,44,4]]}
["Thank you for completing this project's deficiencies!! "]
[]
[]
[]
[]
[]
["Controlling Criteria",null,null,null,null,null,null,null,"Controlling Criteria "]
["High Speed (50mph & <)",null,null,null,null,null,null,null,"Low Speed (<50 mph)"]
[1,"Design Speed",null,null,null,null,null,null,1,"Design Speed"]
[2,"Design Loading Structural Capacity",null,null,null,null,null,null,2,"Design Loading Structural Capacity"]
[3,"Lane Width"]
[4,"Shoulder Width"]
[5,"Horizontal Curve Radius"]
[6,"Superelevation Rate"]
[7,"Stopping Sight Distance"]
[8,"Maximum Grade"]
[9,"Cross Slope"]
[10,"Vertical Clearance"]
[]
[]
{"$rows_left_out":26}
{"sheet":"Grade Checks","index":2,"n_rows":23,"n_cols":14,"rows_kept":23,"cut":false,"hidden":false,"merged":[[6,1,6,5],[3,0,3,5],[4,1,4,5],[5,1,5,5],[0,1,0,8],[1,1,1,8],[2,1,2,8]]}
["Project ID:",{"$f":"IF(Deficiencies!B1=\"\",\"\",Deficiencies!B1)","v":"1440-39-30"}]
["Description:",{"$f":"IF(Deficiencies!B2=\"\",\"\",Deficiencies!B2)","v":"FDL - Plymouth, USH 151 - CTH UU"},null,null,null,null,null,null,null,null,null,null,null,"3R Projects: Design Speed = Posted Speed"]
["Highway:",{"$f":"IF(Deficiencies!B3=\"\",\"\",Deficiencies!B3)","v":"STH 23"}]
["Maximum Grade Check (FDM 11-10 Attatchment 5.3)"]
["Type of Roadway: ","Principal Arterial"]
["Type of Terrain:","Level"]
["Design Speed(s):","35 MPH, 45 MPH, 55 MPH"]
["Asbuilt","Location","Grade","Design Speed","Maximum Grade","Grade: Pass/Fail","Comments","Key"]
["1442-01-73","STH 23 EB, to 2040' East of CTH K",7.0000000000000007E-2,45,0.04,{"$f":"IF(C9=\"\",\"\",IF(E9>ABS(C9),\"Pass\",\"Fail\"))","v":"Fail"},"Not controlling, Deisgn Speed less than 50 MPH",1]
["1442-01-73","STH 23 EB, from 2040' East of CTH K",-4.1000000000000003E-3,55,0.03,{"$f":"IF(C10=\"\",\"\",IF(E10>ABS(C10),\"Pass\",\"Fail\"))","v":"Pass"},null,2]
["1442-01-73","STH 23, from 3640' East of CTH K",4.9919999999999999E-2,55,0.03,"Fail",null,3]
["1442-01-73","STH 23, from 1790' West of CTH UU",-7.8499999999999993E-3,55,0.03,"Pass",null,4]
["1442-01-73","STH 23, 840' West of CTH UU - CTH UU",3.5799999999999998E-3,55,0.03,"Pass",null,5]
[null,null,null,null,null,"",null,6]
[null,null,null,null,null,"",null,7]
[null,null,null,null,null,"",null,8]
[null,null,null,null,null,"",null,9]
[null,null,null,null,null,"",null,10]
[null,null,null,null,null,"",null,11]
[null,null,null,null,null,"",null,12]
{"$rows_left_out":4}
{"sheet":"Vertical Curve Checks","index":3,"n_rows":47,"n_cols":25,"rows_kept":47,"cut":false,"hidden":false,"merged":[[3,0,3,10],[0,1,0,7],[1,1,1,7],[2,1,2,7],[34,18,35,18],[19,4,20,4],[34,0,35,0],[34,4,35,4],[4,12,4,13],[19,0,20,0],[19,2,20,2],[19,1,20,1],[4,1,5,1],[4,2,5,2],[4,3,5,3],[4,4,5,4],[19,17,20,17],[19,6,20,6],[19,7,20,7],[19,5,20,5],[19,8,20,8],[19,9,20,9],[19,10,19,11],[19,12,19,13],[19,14,19,15],[19,16,20,16],[34,21,35,21],[33,1,33,21],[34,5,35,5],[34,6,35,6],[34,7,35,7],[34,8,35,8],[34,9,35,9],[34,10,34,11],[34,12,34,13],[34,14,34,15],[34,16,35,16],[34,17,35,17],[34,1,35,1],[34,2,35,2],[34,3,35,3],[34,19,35,19],[18,22,20,22],[33,22,35,22],[4,22,5,22],[18,1,18,21],[4,21,5,21],[19,18,20,18],[19,21,20,21],[19,19,20,19],[19,20,20,20],[19,3,20,3],[4,5,5,5],[4,6,5,6],[4,7,5,7],[4,8,5,8],[4,9,5,9],[34,20,35,20],[4,0,5,0],[4,20,5,20],[4,19,5,19],[4,18,5,18],[4,16,5,16],[4,17,5,17],[4,10,4,11],[4,14,4,15]]}
["Project ID:",{"$f":"IF(Deficiencies!B1=\"\",\"\",Deficiencies!B1)","v":"1440-39-30"},null,null,null,null,null,null,null,null,null,null,null,null,null,null,null,null,null,null,null,null,null,null,11]
["Description:",{"$f":"IF(Deficiencies!B2=\"\",\"\",Deficiencies!B2)","v":"FDL - Plymouth, USH 151 - CTH UU"},null,null,null,null,null,null,null,null,null,null,"3R Projects: Design Speed = Posted Speed"]
["Highway:",{"$f":"IF(Deficiencies!B3=\"\",\"\",Deficiencies!B3)","v":"STH 23"}]
["Vertical Curve Checks (FDM 11-10 Exhibit 5.4)",null,null,null,null,null,null,null,null,null,null,null,null,null,null,null,null,null,null,null,null,null,null,"Rows",4]
["Asbuilt","Location","PI","Desgin Speed","Curve Type","L","G1","G2","A","K","Crest (6\"Object)",null,"Crest (24\" Object)",null,"Sag",null,"Desirable S","K","k-Check","Sight Distance Check","Combined Pass/Fail","Comment","Key"]
[null,null,null,null,null,null,null,null,null,null,"S, (S>L)","S,(S<L)","S, (S>L)","S,(S<L)","S,  (S>L)","S,  (S<L)"]
["1442-01-73","STH 23 WB, 2040' East of CTH K","157+00",45,"crest",1450,7,-0.41,{"$f":"IF(H7=\"\",\"\",ABS(H7-G7))","v":7.41},{"$f":"IF(F7=\"\",\"\",F7/I7)","v":195.68151147098516},{"$f":"IF(AND($E7=\"Crest\",$F7<$Q7),(((1329/$I7)+$F7)/2),\"\")","v":""},{"$f":"IF(AND($E7=\"Crest\",$F7>$Q7),(((1329*F7)/I7)^(1/2)),\"\")","v":509.96149731615941},{"$f":"IF(AND($E7=\"Crest\",$F7<$Q7),(((2158/$I7)+$F7)/2),\"\")","v":""},{"$f":"IF(AND($E7=\"Crest\",$F7>$Q7),(((2158*$F7)/$I7)^(1/2)),\"\")","v":649.83128714642999},{"$f":"IF(AND($E7=\"Sag\",$F7<$Q7),((I7*F7)+400)/((2*I7)-3.5),\"\")","v":""},{"$f":"IF(AND($E7=\"Sag\",$F7>$Q7),((SQRT(49*F7^2+6400*I7*F7)+7*F7)/(4*I7)),\"\")","v":""},360,98,{"$f":"IF(B7=\"\",\"\",IF(J7>R7, \"Pass\",\"Fail\"))","v":"Pass"},{"$f":"IF(I7=\"\",\"\",IF(E7=\"Crest\",IF(F7<Q7,IF(K7>Q7,IF(M7>Q7,\"Both Pass\",\"6-In Pass/24-In Fail\"),IF(M7>Q7,\"6-In Fail/ 24-In Pass\",\"Both Fail\")),IF(L7>Q7,IF(N7>Q7,\"Both Pass\",\"6-In Pass/24-In Fail\"),IF(N7>Q7,\"6-In Fail/24-In Pass\",\"Both Fail\"))),IF(F7<Q7,IF(O7>Q7,\"Pass\",\"Fail\"),IF(P7>Q7,\"Pass\",\"Fail\"))))","v":"Both Pass"},{"$f":"IF(T7=\"\",\"\",IF(S7=\"Pass\",IF(OR(T7=\"Both Pass\",T7=\"Pass\"),\"Both Pass\",IF(T7=\"6-In Pass/24-In Fail\",\"K Pass/SSD Min Pass\",\"K Pass/ SSD Fail\")),IF(OR(T7=\"Pass\",T7=\"Both Pass\"),\"K Fail/ SSD Pass\",IF(T7=\"6-In Pass/24-In Fail\",\"K Fail/SSD Min Pass\",\"Both Fail\"))))","v":"Both Pass"},null,1]
["1442-01-73","STH 23 EB, 2040' East of CTH K","157+00",45,"crest",1450,7,-0.41,{"$f":"IF(H8=\"\",\"\",ABS(H8-G8))","v":7.41},{"$f":"IF(F8=\"\",\"\",F8/I8)","v":195.68151147098516},{"$f":"IF(AND($E8=\"Crest\",$F8<$Q8),(((1329/$I8)+$F8)/2),\"\")","v":""},{"$f":"IF(AND($E8=\"Crest\",$F8>$Q8),(((1329*F8)/I8)^(1/2)),\"\")","v":509.96149731615941},{"$f":"IF(AND($E8=\"Crest\",$F8<$Q8),(((2158/$I8)+$F8)/2),\"\")","v":""},{"$f":"IF(AND($E8=\"Crest\",$F8>$Q8),(((2158*$F8)/$I8)^(1/2)),\"\")","v":649.83128714642999},{"$f":"IF(AND($E8=\"Sag\",$F8<$Q8),((I8*F8)+400)/((2*I8)-3.5),\"\")","v":""},{"$f":"IF(AND($E8=\"Sag\",$F8>$Q8),((SQRT(49*F8^2+6400*I8*F8)+7*F8)/(4*I8)),\"\")","v":""},360,98,{"$f":"IF(B8=\"\",\"\",IF(J8>R8, \"Pass\",\"Fail\"))","v":"Pass"},{"$f":"IF(I8=\"\",\"\",IF(E8=\"Crest\",IF(F8<Q8,IF(K8>Q8,IF(M8>Q8,\"Both Pass\",\"6-In Pass/24-In Fail\"),IF(M8>Q8,\"6-In Fail/ 24-In Pass\",\"Both Fail\")),IF(L8>Q8,IF(N8>Q8,\"Both Pass\",\"6-In Pass/24-In Fail\"),IF(N8>Q8,\"6-In Fail/24-In Pass\",\"Both Fail\"))),IF(F8<Q8,IF(O8>Q8,\"Pass\",\"Fail\"),IF(P8>Q8,\"Pass\",\"Fail\"))))","v":"Both Pass"},{"$f":"IF(T8=\"\",\"\",IF(S8=\"Pass\",IF(OR(T8=\"Both Pass\",T8=\"Pass\"),\"Both Pass\",IF(T8=\"6-In Pass/24-In Fail\",\"K Pass/SSD Min Pass\",\"K Pass/ SSD Fail\")),IF(OR(T8=\"Pass\",T8=\"Both Pass\"),\"K Fail/ SSD Pass\",IF(T8=\"6-In Pass/24-In Fail\",\"K Fail/SSD Min Pass\",\"Both Fail\"))))","v":"Both Pass"},null,2]
["1442-01-73","STH 23, 3640' East of CTH K","173+00",55,"sag",1100,-0.41,4.992,5.4020000000000001,203.62828582006665,"","","","","",812.89772393613407,495,115,"Pass","Pass","Both Pass",null,3]
["1442-01-73","STH 23, 1790' West of CTH UU","185+50",55,"crest",1200,4.992,-0.78500000000000003,5.7770000000000001,207.72027003635105,"",525.41434970726732,"",669.52247366197173,"","",495,185,"Pass","Both Pass","Both Pass",null,4]
["1442-01-73","STH 23, 840' West of CTH UU","195+00",55,"sag",300,-0.78500000000000003,0.35799999999999998,1.143,262.46719160104988,"","","","","",1021.4203524253682,null,115,"Pass","Pass","Both Pass",null,5]
[null,null,null,null,null,null,null,null,"","","","","","","","",null,null,"","","",null,6]
[null,null,null,null,null,null,null,null,"","","","","","","","",null,null,"","","",null,7]
[null,null,null,null,null,null,null,null,"","","","","","","","",null,null,"","","",null,8]
[null,null,null,null,null,null,null,null,"","","","","","","","",null,null,"","","",null,9]
[null,null,null,null,null,null,null,null,"","","","","","","","",null,null,"","","",null,10]
[null,null,null,null,null,null,null,null,"","","","","","","","",null,null,"","","",null,11]
[]
[null,"Design Speed Testing",null,null,null,null,null,null,null,null,null,null,null,null,null,null,null,null,null,null,null,null,"Key"]
["Asbuilt","Location","Pass/Fail","Desgin Speed","Curve Type","L","G1","G2","A","K","Crest (6\"Object)",null,"Crest (24\" Object)",null,"Sag",null,"Desirable S","K","k-Check","Sight Distance Check","Combined Pass/Fail","Comment"]
{"$rows_left_out":28}
{"sheet":"Horizontal Curve","index":4,"n_rows":34,"n_cols":25,"rows_kept":34,"cut":false,"hidden":false,"merged":[[18,7,20,7],[0,1,0,7],[1,1,1,7],[2,1,2,7],[5,17,6,17],[5,12,6,12],[5,13,6,13],[5,8,6,8],[5,16,6,16],[19,3,19,6],[19,0,19,2],[18,0,18,6],[3,0,3,6],[5,0,6,0],[5,7,6,7],[5,14,6,14],[5,11,6,11],[5,15,6,15],[4,19,6,19],[5,18,6,18],[4,10,4,18],[5,10,6,10],[5,6,6,6],[5,9,6,9],[4,0,4,6],[5,1,6,1],[5,2,6,2],[5,3,6,3],[5,4,6,4],[5,5,6,5]]}
["Project ID:",{"$f":"IF(Deficiencies!B1=\"\",\"\",Deficiencies!B1)","v":"1440-39-30"},null,null,null,null,null,null,null,null,null,null,null,null,null,null,null,null,null,null,null,null,null,null,10]
["Description:",{"$f":"IF(Deficiencies!B2=\"\",\"\",Deficiencies!B2)","v":"FDL - Plymouth, USH 151 - CTH UU"},null,null,null,null,null,null,null,null,"3R Projects: Design Speed = Posted Speed"]
["Highway:",{"$f":"IF(Deficiencies!B3=\"\",\"\",Deficiencies!B3)","v":"STH 23"}]
["Horizontal Curve Checks (FDM 11-10 Attatchment 5.1 - 5.14)",null,null,null,null,null,null,null,null,null,null,null,null,null,null,null,null,null,null,null,null,null,null,"Rows",5]
["Existing Conditions",null,null,null,null,null,null,null,null,null,"Minimum Required or Maximum e% For Speed",null,null,null,null,null,null,null,null,"Key"]
["Asbuilt Plan","Location","PI (STA)","Posted Speed","Design Speed","R \n(curve radius)","RO\n(Superelevation runoff length)","e \n(Superelevation)","SE (T) \n(Superelevation Transition)","Degree of Curve (D),(Degrees, Minutes)","Design Speed","e% \n(Superelevation)","R, min","L, min","X\n(Superelevation runoff length)","SE (T) \n(Superelevation Transition)","Degree of Curve (D),(Degrees, Minutes)","Current Super Pass/Fail","Existing Alignment Pass/Fail"]
[]
["1442-01-73","2050' east of CTH K","157+00.15",45,{"$f":"IF(D8=\"\",\"\",D8+5)","v":50},5729.58,null,3.2000000000000001E-2,108.93,1,{"$f":"IF(E8=\"\",\"\",E8)","v":50},0,643,200,67,267,null,{"$f":"IF(L8=\"\",\"\",IF(L8<=H8,\"Pass\",\"Fail\"))","v":"Pass"},{"$f":"IF(M8=\"\",\"\",IF(F8>M8,\"Pass\",\"Fail\"))","v":"Pass"},1]
["1442-01-73","3100' east of CTH K","167+52.50",55,{"$f":"IF(D9=\"\",\"\",D9+5)","v":60},5729.58,null,3.2000000000000001E-2,108.9,1,{"$f":"IF(E9=\"\",\"\",E9)","v":60},2.4E-2,1060,230,77,307,null,{"$f":"IF(L9=\"\",\"\",IF(L9<=H9,\"Pass\",\"Fail\"))","v":"Pass"},{"$f":"IF(M9=\"\",\"\",IF(F9>M9,\"Pass\",\"Fail\"))","v":"Pass"},2]
["1442-01-73","3988' east of CTH K","176+38.20",55,60,5729.58,null,3.2000000000000001E-2,108.9,1,60,2.4E-2,1060,230,77,307,null,"Pass","Pass",3]
[null,null,null,null,"",null,null,null,null,null,"",null,null,null,null,null,null,"","",4]
[null,null,null,null,"",null,null,null,null,null,"",null,null,null,null,null,null,"","",5]
[null,null,null,null,"",null,null,null,null,null,"",null,null,null,null,null,null,"","",6]
[null,null,null,null,"",null,null,null,null,null,"",null,null,null,null,null,null,"","",7]
[null,null,null,null,"",null,null,null,null,null,"",null,null,null,null,null,null,"","",8]
[null,null,null,null,"",null,null,null,null,null,"",null,null,null,null,null,null,"","",9]
[null,null,null,null,"",null,null,null,null,null,"",null,null,null,null,null,null,"","",10]
[]
["Secondary Failure Testing",null,null,null,null,null,null,"Key"]
["Existing Conditions",null,null,"Design Speed Test"]
{"$rows_left_out":15}
{"sheet":"Bridge Considerations","index":5,"n_rows":7,"n_cols":11,"rows_kept":7,"cut":false,"hidden":false,"merged":[[0,1,0,7],[1,1,1,7],[2,1,2,7],[4,10,5,10],[4,6,4,7],[4,8,4,9],[4,5,5,5],[3,0,3,7],[4,0,5,0],[4,1,5,1],[4,2,5,2],[4,3,5,3],[4,4,5,4]]}
["Project ID:",{"$f":"IF(Deficiencies!B1=\"\",\"\",Deficiencies!B1)","v":"1440-39-30"}]
["Description:",{"$f":"IF(Deficiencies!B2=\"\",\"\",Deficiencies!B2)","v":"FDL - Plymouth, USH 151 - CTH UU"}]
["Highway:",{"$f":"IF(Deficiencies!B3=\"\",\"\",Deficiencies!B3)","v":"STH 23"}]
["Bridge Considerations (FDM 11-3-5.4)"]
["Structure Number","Location","Number of Lanes","Lane Width","Bridge Width","Cross Slope","Lateral Clearnce Test",null,"Vertical Clearance Test",null,"Structural Capacity"]
[null,null,null,null,null,null,"Lateral Clearance","Perferred Lateral Clearance","Vertical Clearance","Minimum Vertical Clearance"]
["None"]